• Ingo Molnar's avatar
    ftrace: build fix · 7b928c23
    Ingo Molnar authored
    
    
    fix:
    
     In file included from init/main.c:65:
     include/linux/ftrace.h:166: error: expected ‘,' or ‘;' before ‘{' token
     make[1]: *** [init/main.o] Error 1
     make: *** [init/main.o] Error 2
    Signed-off-by: default avatarIngo Molnar <mingo@elte.hu>
    7b928c23
ftrace.h 6.26 KB