binman: Update various pieces of the documentation

A few sections are a little out of date now. Update them.

Signed-off-by: Simon Glass <sjg@chromium.org>
46 jobs for dm-pull-26mar21 in 3 minutes and 59 seconds (queued for 2 seconds)
latest
Status Name Job ID Coverage
  Testsuites
passed Build envtools #244668
all

00:00:14

passed Build tools-only #244667
all

00:00:19

passed Check for configs without MAINTAINERS entry #244666
all

00:00:23

passed cppcheck #244662
all

00:01:03

passed grep TODO/FIXME/HACK #244663
all

00:00:23

passed htmldocs #244664
all

00:00:36

failed Run binman, buildman, dtoc, Kconfig and patman testsuites #244669
all

00:00:44

passed Run tests for Nokia RX-51 (aka N900) #244670
all

00:03:06

passed sloccount #244665
all

00:00:36

 
  Test.Py
skipped evb-ast2500 test.py #244675
all
skipped integratorcp_cm926ejs test.py #244679
all
skipped qemu_arm64 test.py #244681
all
skipped qemu_arm test.py #244680
all
skipped qemu_malta64el test.py #244689
all
skipped qemu_malta64 test.py #244688
all
skipped qemu_maltael test.py #244687
all
skipped qemu_malta test.py #244686
all
skipped qemu_mips64el test.py #244685
all
skipped qemu_mips64 test.py #244684
all
skipped qemu_mipsel test.py #244683
all
skipped qemu_mips test.py #244682
all
skipped qemu-ppce500 test.py #244690
all
skipped qemu-riscv32_spl test.py #244693
all
skipped qemu-riscv32 test.py #244691
all
skipped qemu-riscv64_spl test.py #244694
all
skipped qemu-riscv64 test.py #244692
all
skipped qemu-x86_64 test.py #244696
all
skipped qemu-x86 test.py #244695
all
skipped r2dplus_i82557c test.py #244697
all
skipped r2dplus_pcnet test.py #244698
all
skipped r2dplus_rtl8139 test.py #244699
all
skipped r2dplus_tulip test.py #244700
all
skipped sandbox_flattree test.py #244676
all
skipped sandbox_noinst_test.py #244674
all
skipped sandbox_spl test.py #244673
all
skipped sandbox test.py #244671
all
skipped sandbox with clang test.py #244672
all
skipped vexpress_ca15_tc2 test.py #244677
all
skipped vexpress_ca9x4 test.py #244678
all
skipped xilinx_versal_virt test.py #244702
all
skipped xilinx_zynq_virt test.py #244701
all
skipped xtfpga test.py #244703
all
 
  World Build
skipped build all 32bit ARM platforms #244704
all
skipped build all 64bit ARM platforms #244705
all
skipped build all other platforms #244707
all
skipped build all PowerPC platforms #244706
all
 
Name Stage Failure
failed
Run binman, buildman, dtoc, Kconfig and patman testsuites Testsuites
+make[4]: *** [scripts/dtc/pylibfdt/libfdt.py] Error 1
+make[4]: *** Deleting file 'scripts/dtc/pylibfdt/libfdt.py'
+make[3]: *** [scripts/dtc/pylibfdt] Error 2
+make[2]: *** [scripts/dtc] Error 2
+make[1]: *** [scripts] Error 2
+make: *** [sub-make] Error 2
0 0 1 /1 sandbox_spl
Completed: 1 total built, duration 0:00:09, rate 0.11
ERROR: Job failed: exit code 1